Unnamed: 0,Unnamed: 1,Unnamed: 2,Unnamed: 3,Unnamed: 4,Unnamed: 5,Unnamed: 6,Unnamed: 7,Unnamed: 8,Unnamed: 9,Unnamed: 10,Unnamed: 11,Unnamed: 12
,,,,Durante este tiempo ha consumido algún producto preventivo anticovid-19,"Si la respuesta anterior fue si especificar (1 =Herbals, 2= Medicinal drugs, 3= Vitamins, 4= Alcohol, 5= Chlorine dioxide, 6= other)",,,Tiene algun familiar que ha consumido algun producto para prevenir el COVID,"Si la respuesta anterior fue si especificar (1 =Herbals, 2= Medicinal drugs, 3= Vitamins, 4= Alcohol, 5= Chlorine dioxide, 6= other)",,,
,Edad,Gnero,,,Tratamiento 1,Tratamiento 2 ,Tratamiento 3,,Tratamiento 1,Tratamiento 2,Tratamiento 3,
,35-59 años,Masculino,Posgrado,No,,,,No,,,,
,35-59 años,Femenino,Posgrado,Si,6,,,No,Homeopático,,,
,35-59 años,Masculino,Licenciatura,Si,1,3,Bebidas alcohólicas,Si,,Herbolaria ,,
,19-34 años,Masculino,Posgrado,No,,,,No,,,,
,19-34 años,Femenino,Licenciatura,Si,4,,,No,,,,
,19-34 años,Femenino,Preparatoria,No,,,,Si,,Dióxido de cloro,,
,19-34 años,Masculino,Licenciatura,No,,,,No,,,,
,19-34 años,Femenino,Preparatoria,Si,3,1,,Si,,Medicamento,,
,35-59 años,Femenino,Posgrado,No,,,,No,,,,
,19-34 años,Masculino,Licenciatura,No,,,,No,,,,
,19-34 años,Femenino,Licenciatura,No,,,,No,,,,
,19-34 años,Femenino,Posgrado,No,,,,No,,,,
,35-59 años,Femenino,Posgrado,No,,,,No,,,,
,35-59 años,Femenino,Preparatoria,No,,,,No,,,,
,19-34 años,Femenino,Posgrado,No,,,,No,,,,
,19-34 años,Masculino,Posgrado,No,,,,No,,,,
,19-34 años,Masculino,Licenciatura,No,,,,No,,,,
,35-59 años,Masculino,Licenciatura,No,,,,No,,,,
,19-34 años,Femenino,Licenciatura,No,,,,No,,,,
,19-34 años,Masculino,Licenciatura,No,,,,No,,,,
,35-59 años,Femenino,Licenciatura,No,,,,No,,,,
,19-34 años,Femenino,Licenciatura,Si,3,,,No,,,,
,19-34 años,Masculino,Licenciatura,No,,,,No,,,,
,19-34 años,Femenino,Licenciatura,Si,3,,,Si,,Remedios caseros ,,
,19-34 años,Masculino,Licenciatura,No,,,,Si,,Vitamina d3,,
,13-18 años,Femenino,Preparatoria,No,,,,No,,,,
,35-59 años,Femenino,Preparatoria,No,,,,No,,,,
,35-59 años,Femenino,Secundaria,Si,2,,,No,,,,
,35-59 años,Femenino,Licenciatura,Si,1,,,Si,,Té de jengibre ,,
,19-34 años,Femenino,Licenciatura,No,,,,No,,,,
,19-34 años,Femenino,Licenciatura,No,,,,No,,,,
,35-59 años,Femenino,Licenciatura,No,,,,No,,,,
,35-59 años,Femenino,Posgrado,No,,,,No,,,,
,35-59 años,Femenino,Licenciatura,No,,,,No,,,,
,35-59 años,Femenino,Licenciatura,No,,,,No,,,,
,19-34 años,Femenino,Posgrado,No,,,,Si,,Dióxido de cloro ,,
,35-59 años,Femenino,Posgrado,Si,3,,,Si,,Suplemento vitamínico ,,
,19-34 años,Masculino,Licenciatura,No,,,,Si,,Dióxido de cloro,,
,35-59 años,Masculino,Licenciatura,No,,,,No,,,,
,19-34 años,Femenino,Licenciatura,No,,,,No,,,,
,35-59 años,Femenino,Posgrado,No,,,,No,,,,
,19-34 años,Masculino,Preparatoria,No,,,,No,,,,
,19-34 años,Femenino,Licenciatura,No,,,,Si,,Remedios herbolarios,,
,19-34 años,Masculino,Licenciatura,No,,,,No,,,,
,19-34 años,Femenino,Licenciatura,No,,,,No,,,,
,35-59 años,Masculino,Posgrado,No,,,,No,,,,
,35-59 años,Femenino,Posgrado,Si,3,,,No,Vitamina C y zinc ,,,
,35-59 años,Femenino,Preparatoria,No,,,,No,,,,
,35-59 años,Femenino,Posgrado,Si,3,,,Si,,suplemento vitaminico,,
,19-34 años,Masculino,Licenciatura,No,,,,No,,,,
,35-59 años,Masculino,Posgrado,No,,,,No,,,,
,19-34 años,Femenino,Licenciatura,Si,3,,,No,,,,
,35-59 años,Femenino,Licenciatura,No,,,,Si,,Dióxido de cloro,,
,19-34 años,Femenino,Posgrado,No,,,,No,,,,
,35-59 años,Femenino,Posgrado,No,,,,No,,,,
,19-34 años,Femenino,Licenciatura,No,,,,No,,,,
,19-34 años,Femenino,Preparatoria,No,,,,Si,,Dióxido de Cloro,Suplemento vitaminico,
,19-34 años,Femenino,Licenciatura,No,,,,No,,,,
,19-34 años,Femenino,Licenciatura,Si,1,,,Si,,Tratamiento herbolario,,
,35-59 años,Masculino,Licenciatura,No,,,,No,,,,
,19-34 años,Masculino,Licenciatura,No,,,,No,,,,
,35-59 años,Femenino,Posgrado,No,,,,No,,,,
,19-34 años,Masculino,Preparatoria,No,,,,No,,,,
,35-59 años,Femenino,Licenciatura,No,,,,No,,,,
,35-59 años,Femenino,Posgrado,Si,1,,,Si,"Té de hoja de guayaba, genjibre, limón y miel",Tratamiento herbolario,dióxido de cloro,El té de guayaba  
,35-59 años,Femenino,Licenciatura,Si,3,,,Si,,suplemento vitaminico,,
,19-34 años,Femenino,Licenciatura,No,,,,No,,,,
,19-34 años,Femenino,Licenciatura,No,,,,Si,,Tratamiento herbolario,Te de guayaba con jengibre ,
,13-18 años,Masculino,Preparatoria,No,,,,Si,,Dióxido de cloro,,
,19-34 años,Masculino,Licenciatura,No,,,,No,,,,
,13-18 años,Femenino,Licenciatura,No,,,,No,,,,
,19-34 años,Femenino,Licenciatura,No,,,,Si,,Dióxido de cloro,,
,19-34 años,Masculino,Licenciatura,No,,,,No,,,,
,19-34 años,Masculino,Licenciatura,No,,,,No,,,,
,19-34 años,Femenino,Licenciatura,No,,,,Si,,Dióxido de cloro,,
,19-34 años,Masculino,Licenciatura,No,,,,No,,,,
,19-34 años,Masculino,Licenciatura,No,,,,No,,,,
,13-18 años,Masculino,Preparatoria,No,,,,No,,,,
,19-34 años,Femenino,Licenciatura,Si,1,3,Medicamento,Si,,suplemento vitaminico,,
,19-34 años,Masculino,Licenciatura,No,,,,Si,,Suplemento vitaminico,,
,19-34 años,Femenino,Licenciatura,Si,3,,,No,,,,
,19-34 años,Femenino,Licenciatura,No,Otros,,,Si,,Productos herbolarios,Suplemento vitaminico,
,19-34 años,Femenino,Licenciatura,Si,2,3,,Si,,sumplemento vitaminico,Medicamento,ivermectina 
,19-34 años,Femenino,Licenciatura,No,,,,Si,,Productos herbolarios,,Ajo negro
,19-34 años,Masculino,Licenciatura,No,,,,No,,,,
,13-18 años,Femenino,Licenciatura,Si,3,,,Si,,Suplemento vitaminico,dióxido de cloro,
,19-34 años,Masculino,Licenciatura,No,,,,No,,,,
,19-34 años,Femenino,Licenciatura,Si,3,6,,No,ajo,,,
,19-34 años,Femenino,Licenciatura,No,,,,No,,,,
,19-34 años,Masculino,Licenciatura,No,,,,Si,,Dioxido de cloro,,
,19-34 años,Masculino,Licenciatura,No,,,,No,,,,
,19-34 años,Masculino,Licenciatura,No,,,,No,,,,
,13-18 años,Femenino,Licenciatura,Si,3,,,No,,,,
,35-59 años,Femenino,Posgrado,No,,,,No,,,,
,60 o más,Femenino,Posgrado,Si,5,3,,Si,,Dióxido de cloro ,Suplemento vitaminico,
,60 o más,Femenino,Primaria,Si,5,1,,Si,,Dióxido de cloro,,
,60 o más,Femenino,Primaria,Si,5,,Medicamento,Si,,Dióxido de cloro,,
,60 o más,Femenino,Posgrado,No,,,,Si,,Dióxido de cloro ,Nanopartículas plata,
,35-59 años,Femenino,Licenciatura,Si,5,,,Si,,Dióxido de cloro,,
,35-59 años,Femenino,Posgrado,Si,5,,,Si,,Dióxido de Cloro,,
,35-59 años,Femenino,Secundaria,Si,5,1,,Si,,Dióxido de cloro,,
,60 o más,Masculino,Licenciatura,Si,5,2,,Si,,Dióxido de cloro,,
,19-34 años,Femenino,Licenciatura,No,,,,No,,,,
,35-59 años,Femenino,Preparatoria,No,,,,No,,,,
,13-18 años,Masculino,Licenciatura,No,,,,No,,,,
,13-18 años,Femenino,Licenciatura,No,,,,No,,,,
,13-18 años,Masculino,Licenciatura,Si,2,,,No,,,,
,13-18 años,Masculino,Licenciatura,No,,,,No,,,,
,13-18 años,Masculino,Licenciatura,No,,,,No,,.,,
,13-18 años,Femenino,Licenciatura,No,,,,No,,,,
,19-34 años,Masculino,Licenciatura,No,,,,No,,,,
,13-18 años,Masculino,Licenciatura,No,,,,No,,,,
,13-18 años,Masculino,Licenciatura,No,Otros,,,No,,,,
,13-18 años,Masculino,Licenciatura,No,,,,No,,,,
,13-18 años,Femenino,Preparatoria,No,,,,No,,,,
,13-18 años,Masculino,Preparatoria,No,,,,No,,,,
,19-34 años,Masculino,Preparatoria,No,,,,No,,,,
,19-34 años,Masculino,Preparatoria,No,,,,Si,,dióxido de cloro,,
,13-18 años,Femenino,Preparatoria,No,,,,No,,,,
,19-34 años,Masculino,Licenciatura,No,,,,No,,,,
,19-34 años,Masculino,Preparatoria,No,,,,No,,,,
,13-18 años,Femenino,Preparatoria,No,,,,No,,,,
,19-34 años,Femenino,Preparatoria,No,,,,No,,,,
,13-18 años,Masculino,Licenciatura,Si,2,,,Si,. ,Medicamentos ,,
,19-34 años,Femenino,Preparatoria,No,,,,No,,,,
,13-18 años,Femenino,Licenciatura,Si,2,1,,No,,,,
,13-18 años,Femenino,Preparatoria,No,,,,No,,,,
,19-34 años,Femenino,Preparatoria,No,,,,No,,,,
,13-18 años,Femenino,Preparatoria,No,,,,No,,,,
,13-18 años,Masculino,Preparatoria,No,,,,No,,,,
,19-34 años,Masculino,Preparatoria,No,,,,No,,,,
,13-18 años,Masculino,Licenciatura,Si,4,,,No,,,,
,13-18 años,Masculino,Preparatoria,No,,,,No,,,,
,13-18 años,Masculino,Preparatoria,Si,3,,,Si,,Suplemento vitamínico,,
,13-18 años,Femenino,Licenciatura,No,,,,Si,,medicamentos ,,
,13-18 años,Femenino,Preparatoria,No,,,,Si,,Medicamento ,,
,13-18 años,Femenino,Preparatoria,Si,3,,,Si,Splemento vitaminico,,,
,13-18 años,Femenino,Preparatoria,Si,4,,,No,,,,
,13-18 años,Femenino,Preparatoria,No,,,,Si,,Dioxido de cloro,,
,13-18 años,Femenino,Licenciatura,Si,4,,,No,,,,
,19-34 años,Masculino,Licenciatura,Si,4,,,Si,,,,
,13-18 años,Masculino,Preparatoria,No,,,,No,,,,
,19-34 años,Masculino,Preparatoria,No,,,,No,,,,
,13-18 años,Masculino,Licenciatura,No,,,,No,,,,
,13-18 años,Masculino,Licenciatura,No,Tratamiento herbolario,Suplemento vitamínico,,Si,,Dióxido de cloro,,
,19-34 años,Masculino,Preparatoria,No,,,,No,,,,
,13-18 años,Femenino,Preparatoria,No,,,,No,,,,
,13-18 años,Masculino,Preparatoria,No,,,,No,,,,
,13-18 años,Masculino,Licenciatura,Si,2,,,Si,AINES,Medicamentos,,
,13-18 años,Femenino,Preparatoria,Si,2,,,No,,,,
,13-18 años,Femenino,Licenciatura,No,,,,No,,,,
,19-34 años,Masculino,Secundaria,No,,,,No,,,,
,13-18 años,Masculino,Preparatoria,Si,3,,,Si,,Suplemento Vitaminico,,
,13-18 años,Masculino,Licenciatura,No,,,,No,,,,
,19-34 años,Femenino,Licenciatura,No,,,,No,,,,
,19-34 años,Femenino,Licenciatura,No,,,,No,,,,
,19-34 años,Femenino,Licenciatura,No,,,,No,,,,
,13-18 años,Femenino,Licenciatura,No,,,,Si,,dioxido de cloro ,,
,13-18 años,Femenino,Licenciatura,No,,,,No,,,,
,19-34 años,Masculino,Licenciatura,No,Otros,,,No,Ninguno.,,,
,19-34 años,Femenino,Licenciatura,Si,3,,,No,,,,
,19-34 años,Femenino,Licenciatura,No,,,,No,,,,
,13-18 años,Femenino,Licenciatura,No,,,,No,,,,
,13-18 años,Femenino,Licenciatura,No,,,,No,,,,
,13-18 años,Femenino,Licenciatura,No,,,,No,,,,
,19-34 años,Masculino,Licenciatura,No,,,,No,,,,
,19-34 años,Femenino,Licenciatura,No,,,,Si,,Medicamentos ,Tratamiento herbolario,
,19-34 años,Femenino,Licenciatura,No,,,,No,,,,
,13-18 años,Femenino,Licenciatura,Si,3,,,No,,,,
,19-34 años,Femenino,Licenciatura,No,,,,Si,,Tratamiento herbolario,,
,13-18 años,Femenino,Preparatoria,No,,,,No,,,,
,13-18 años,Masculino,Licenciatura,No,Otros,,,No,.,.,,
,19-34 años,Masculino,Preparatoria,No,,,,Si,,Tratamiento herbolario,,
,19-34 años,Femenino,Licenciatura,No,,,,No,,,,
,13-18 años,Masculino,Preparatoria,No,,,,Si,,dioxido de cloro,,
,13-18 años,Masculino,Licenciatura,No,,,,No,,,,
,13-18 años,Masculino,Licenciatura,No,,,,No,,,,
,19-34 años,Femenino,Licenciatura,No,,,,Si,,Tratamiento herbolario,,Té de guayaba
,13-18 años,Masculino,Licenciatura,No,,,,Si,,Tratamiento herbolario,,Te de canela
,13-18 años,Femenino,Licenciatura,No,,,,Si,,Tratamiento herbolario ,,
,19-34 años,Masculino,Preparatoria,No,Medicamento ,,,No,,,,
,19-34 años,Femenino,Licenciatura,No,,,,Si,,Suplemento Vitaminico,,
,13-18 años,Masculino,Licenciatura,No,,,,No,,,,
,19-34 años,Femenino,Licenciatura,No,,,,No,,,,
,19-34 años,Masculino,Licenciatura,Si,4,,,No,,,,
,19-34 años,Femenino,Preparatoria,No,,,,No,,,,
,19-34 años,Masculino,Licenciatura,No,,,,No,,,,
,35-59 años,Masculino,Posgrado,No,,,,No,,,,
,19-34 años,Femenino,Licenciatura,No,,,,No,,,,
,35-59 años,Femenino,Preparatoria,No,,,,No,,,,
,19-34 años,Femenino,Posgrado,No,,,,No,,,,
,19-34 años,Femenino,Posgrado,Si,3,,,Si,Vitamina D,Suplemento Vitaminico,,
,19-34 años,Femenino,Licenciatura,No,,,,No,,,,
,19-34 años,Femenino,Preparatoria,No,,,,Si,,Tratamientos herbolario,,
,35-59 años,Femenino,Licenciatura,No,Otros,,,Si,"Fue otro, porque me dió Covid-19,y fue medicamento supervisado.",Medicamento,,Azitromicina
,19-34 años,Masculino,Licenciatura,No,,,,No,,,,
,19-34 años,Femenino,Licenciatura,No,,,,No,,,,
,19-34 años,Femenino,Licenciatura,No,,,,Si,,Dióxido de cloro,,
,19-34 años,Masculino,Posgrado,Si,3,,,No,,,,
,19-34 años,Masculino,Licenciatura,Si,2,,,Si,,Medicamentos,,AINES
,19-34 años,Femenino,Licenciatura,No,,,,Si,,Dióxido de cloro,,
,19-34 años,Femenino,Licenciatura,Si,3,,,Si,,Dióxido de cloro ,Suplemento vitaminico,
,19-34 años,Femenino,Licenciatura,Si,3,,,No,,,,
,19-34 años,Femenino,Licenciatura,No,,,,No,,,,
,19-34 años,Masculino,Licenciatura,No,,,,No,,,,
,19-34 años,Masculino,Licenciatura,No,,,,Si,,,,
,19-34 años,Femenino,Licenciatura,No,,,,Si,,Dioxido de cloro,,
,19-34 años,Femenino,Licenciatura,No,,,,No,,,,
,19-34 años,Femenino,Licenciatura,No,,,,No,,,,
,19-34 años,Femenino,Licenciatura,No,,,,No,,,,
,19-34 años,Femenino,Licenciatura,No,,,,No,,,,
,19-34 años,Femenino,Preparatoria,Si,1,,,No,,,,
,19-34 años,Masculino,Licenciatura,No,,,,No,,,,
,19-34 años,Femenino,Licenciatura,Si,5,,,No,,,,
,19-34 años,Femenino,Licenciatura,Si,3,,,Si,,Suplemento Vitaminico,,
,35-59 años,Masculino,Posgrado,Si,3,,,No,,,,
,19-34 años,Femenino,Preparatoria,Si,1,2,,No,,,,
,19-34 años,Femenino,Licenciatura,No,,,,No,,,,
,19-34 años,Femenino,Licenciatura,No,,,,No,,,,
,19-34 años,Femenino,Licenciatura,No,,,,Si,,Dióxido de cloro ,,
,35-59 años,Femenino,Licenciatura,No,,,,No,,,,
,35-59 años,Femenino,Posgrado,No,,,,No,,,,
,19-34 años,Femenino,Posgrado,No,,,,No,,,,
,35-59 años,Femenino,Secundaria,No,Bebidas alcohólicas,,,No,,,,
,19-34 años,Femenino,Licenciatura,No,,,,No,,,,
,19-34 años,Femenino,Posgrado,Si,3,,,Si,,Suplemento vitaminico,,
,19-34 años,Femenino,Licenciatura,No,,,,Si,,Dióxido de cloro,Tratamiento herbolario,
,35-59 años,Femenino,Licenciatura,No,,,,No,,,,
,19-34 años,Femenino,Licenciatura,Si,3,,,Si,N-acetilcisteina ,Tratamiento herbolario,,Planta guaco
,35-59 años,Femenino,Licenciatura,Si,3,,,No,Vitaminas,,,
,35-59 años,Masculino,Licenciatura,Si,2,,,No,,,,
,60 o más,Femenino,Posgrado,No,,,,No,,,,
,35-59 años,Femenino,Licenciatura,Si,6,,,Si,"Vitamina c,vitamina d,",Suplemento vitaminico,,
,19-34 años,Femenino,Licenciatura,No,,,,No,,,,
,35-59 años,Femenino,Preparatoria,No,,,,No,,,,
,19-34 años,Femenino,Licenciatura,No,Suplemento vitamínico,,,No,Vitaminas ,,,
,35-59 años,Masculino,Licenciatura,Si,3,1,,Si,,Tratamiento herbolario,,
,19-34 años,Masculino,Posgrado,No,,,,Si,,Medicamento,,Pidotimod
,35-59 años,Femenino,Licenciatura,No,,,,No,TE DE JENGIBRE Y TE DE CASCARAS DE LIMÓN,,,
,35-59 años,Femenino,Licenciatura,Si,6,,,Si,Hervolario,,,
,19-34 años,Masculino,Posgrado,No,,,,Si,,Tratamiento herbolario,,
,19-34 años,Femenino,Posgrado,No,,,,No,,,,
,19-34 años,Femenino,Licenciatura,No,,,,No,,,,
,19-34 años,Masculino,Licenciatura,No,,,,Si,,Medicamentos,,Factor de transferencia
,13-18 años,Masculino,Secundaria,No,,,,No,,,,
,13-18 años,Femenino,Secundaria,No,,,,Si,,,,
,19-34 años,Femenino,Licenciatura,No,,,,No,,,,
,13-18 años,Femenino,Secundaria,Si,3,,,No,,,,
,19-34 años,Femenino,Licenciatura,Si,1,,,Si,,Dióxido de cloro,,
,19-34 años,Femenino,Secundaria,No,,,,Si,,Tratamiento herbolario ,,
,13-18 años,Femenino,Secundaria,No,,,,No,,,,
,13-18 años,Femenino,Secundaria,No,,,,No,,,,
,19-34 años,Femenino,Licenciatura,No,,,,No,,,,
,19-34 años,Femenino,Licenciatura,Si,3,,,No,,,,
,13-18 años,Femenino,Secundaria,No,,,,No,,,,
,19-34 años,Femenino,Licenciatura,Si,3,,,Si,,Suplementos vitamínicos ,,
,19-34 años,Femenino,Licenciatura,No,,,,Si,,Tratamiento herbolario,,
,19-34 años,Femenino,Licenciatura,No,,,,No,,,,
,35-59 años,Femenino,Secundaria,No,,,,No,,,,
,13-18 años,Masculino,Secundaria,No,,,,No,,,,
,19-34 años,Femenino,Licenciatura,No,,,,No,,,,
,19-34 años,Masculino,Licenciatura,No,,,,Si,,Medicamentos,,Invermectina
,13-18 años,Masculino,Secundaria,No,,,,No,,,,
,35-59 años,Femenino,Licenciatura,Si,3,,,No,,,,
,35-59 años,Masculino,Licenciatura,No,,,,No,,,,
,13-18 años,Masculino,Secundaria,No,,,,Si,,Dióxido de cloro,,
,13-18 años,Femenino,Secundaria,Si,2,,,No,,,,
,35-59 años,Masculino,Posgrado,No,,,,No,,,,
,13-18 años,Masculino,Secundaria,Si,2,,,No,,,,
,19-34 años,Femenino,Licenciatura,No,,,,No,,,,
,13-18 años,Masculino,Secundaria,Si,2,,,Si,,Medicamento,,
,13-18 años,Femenino,Preparatoria,No,,,,Si,,Medicamento,,
,13-18 años,Femenino,Secundaria,No,,,,No,,,,
,13-18 años,Femenino,Secundaria,Si,2,,,No,,,,
,13-18 años,Femenino,Preparatoria,Si,3,,,Si,,Suplemento vitaminico,,
,19-34 años,Femenino,Licenciatura,Si,3,,,Si,Gomitas del dr. Simi,Vitaminas,,
,19-34 años,Femenino,Licenciatura,No,,,,Si,,Dióxido de cloro,,
,19-34 años,Femenino,Licenciatura,No,,,,No,,,,
,19-34 años,Femenino,Licenciatura,No,,,,Si,,Medicamentos,,AINES
,13-18 años,Femenino,Preparatoria,No,,,,No,,,,
,19-34 años,Femenino,Preparatoria,No,,,,No,,,,
,13-18 años,Femenino,Preparatoria,No,,,,No,,,,
,13-18 años,Femenino,Preparatoria,No,,,,No,,,,
,13-18 años,Masculino,Secundaria,No,,,,No,,,,
,13-18 años,Femenino,Secundaria,No,,,,No,,,,
,19-34 años,Masculino,Preparatoria,No,,,,No,,,,
,19-34 años,Femenino,Preparatoria,No,Otros,,,No,,,,
,19-34 años,Masculino,Licenciatura,Si,3,,,No,,,,
,19-34 años,Femenino,Licenciatura,No,,,,No,,,,
,19-34 años,Femenino,Licenciatura,Si,2,5,Suplemento vitamínico,Si,,Medicamento,,
,19-34 años,Masculino,Licenciatura,No,,,,No,,,,
,19-34 años,Masculino,Licenciatura,No,,,,No,,,,
,19-34 años,Femenino,Licenciatura,No,,,,No,,,,
,19-34 años,Femenino,Licenciatura,No,,,,No,,,,
,19-34 años,Femenino,Licenciatura,Si,3,,,Si,,Suplemento vitaminico,,
,13-18 años,Masculino,Licenciatura,Si,3,,,Si,,Suplemento vitamínico ,,
,19-34 años,Masculino,Licenciatura,Si,3,,,No,,,,
,19-34 años,Masculino,Licenciatura,No,,,,No,,,,
,19-34 años,Femenino,Licenciatura,No,,,,Si,,dioxido de cloro,,
,13-18 años,Femenino,Licenciatura,No,,,,Si,,dióxido de cloro,,
,19-34 años,Femenino,Licenciatura,No,,,,Si,,Dioxido de cloro,,
,19-34 años,Masculino,Licenciatura,No,,,,No,,,,
,19-34 años,Masculino,Preparatoria,No,Suplemento vitamínico,,,Si,,Suplemento vitaminico,,
,13-18 años,Masculino,Licenciatura,No,,,,No,,,,
,19-34 años,Masculino,Licenciatura,No,,,,No,,,,
,19-34 años,Femenino,Licenciatura,Si,2,3,,Si,"Ivermectina, vitamina C entre otras vitaminas.",Dióxido de cloro,,
,19-34 años,Masculino,Licenciatura,Si,3,,,Si,Acido ascorbico,Suplemento vitaminico,,Vitamina C
,13-18 años,Masculino,Licenciatura,Si,2,,,Si,,,,
,19-34 años,Femenino,Licenciatura,No,,,,No,,,,
,13-18 años,Femenino,Licenciatura,Si,3,,,Si,,Suplementos vitamínicos ,,
,19-34 años,Femenino,Licenciatura,No,,,,Si,,Dióxido de cloro ,,
,19-34 años,Femenino,Licenciatura,No,,,,Si,,,,
,19-34 años,Masculino,Licenciatura,No,,,,No,,,,
,19-34 años,Masculino,Licenciatura,No,Otros,,,Si,Ninguno,Suplemento alimenticios,Dioxido de cloro,
,19-34 años,Masculino,Licenciatura,No,,,,Si,,Suplementos vitaminicos,,Vitamina C
,19-34 años,Femenino,Licenciatura,Si,3,,,No,,,,
,19-34 años,Femenino,Licenciatura,No,,,,Si,,Tratamiento herbolaria,dióxido de cloro,
,13-18 años,Femenino,Licenciatura,No,,,,Si,,suplementos vitamínicos,Tratamiento herbolarios,
,19-34 años,Masculino,Licenciatura,No,,,,No,,,,
,19-34 años,Femenino,Licenciatura,No,,,,No,,,,
,19-34 años,Masculino,Preparatoria,No,,,,No,,,,
,19-34 años,Femenino,Licenciatura,Si,5,,,Si,,Dióxido de cloro.,,
,19-34 años,Femenino,Licenciatura,No,,,,No,,,,
,19-34 años,Femenino,Preparatoria,Si,6,,,Si, enjuague bucal,Tratamiento herbolarios,,
,19-34 años,Femenino,Licenciatura,Si,2,,,No,,,,
,19-34 años,Femenino,Licenciatura,Si,2,1,,Si,,Medicamentos,,Ivermectina 
,19-34 años,Masculino,Licenciatura,No,,,,No,,,,
,13-18 años,Masculino,Preparatoria,No,,,,No,,,,
,19-34 años,Masculino,Licenciatura,No,,,,No,,,,
,19-34 años,Femenino,Licenciatura,No,,,,Si,,Tratamiento herbolario ,,
,19-34 años,Femenino,Licenciatura,No,,,,No,,,,
,19-34 años,Masculino,Preparatoria,No,,,,No,,,,
,19-34 años,Femenino,Licenciatura,No,,,,No,,,,
,19-34 años,Femenino,Licenciatura,No,,,,No,,,,
,19-34 años,Femenino,Licenciatura,Si,3,,,Si,,Suplemento vitaminico ,,
,19-34 años,Masculino,Licenciatura,No,,,,No,,,,
,19-34 años,Femenino,Licenciatura,No,,,,Si,,Suplemento vitaminico,,
,19-34 años,Masculino,Licenciatura,No,,,,No,,,,
,19-34 años,Femenino,Licenciatura,No,,,,No,,,,
,19-34 años,Femenino,Licenciatura,No,,,,No,,,,
,19-34 años,Femenino,Licenciatura,No,,,,No,,,,
,19-34 años,Femenino,Licenciatura,No,,,,Si,,Dióxido de cloro,,
,19-34 años,Masculino,Licenciatura,No,,,,No,,,,
,19-34 años,Femenino,Licenciatura,No,,,,Si,,Medicamento,,"Antiviral, prednisona y Fluticasona "
,19-34 años,Femenino,Licenciatura,No,,,,No,,,,
,19-34 años,Masculino,Licenciatura,Si,3,,,No,,,,
,19-34 años,Femenino,Licenciatura,No,,,,No,,,,
,19-34 años,Masculino,Licenciatura,No,,,,Si,,Medicamento,,
,19-34 años,Femenino,Licenciatura,No,,,,No,,,,
,19-34 años,Femenino,Licenciatura,No,,,,Si,,Tratamiento Herbolario ,,
,19-34 años,Masculino,Licenciatura,No,,,,Si,,Medicamento,,Factor de transferencia
,19-34 años,Femenino,Licenciatura,No,,,,No,,,,
,19-34 años,Femenino,Licenciatura,No,,,,Si,,Tratamiento herbolario ,,
,19-34 años,Masculino,Licenciatura,No,,,,No,,,,
,19-34 años,Femenino,Licenciatura,Si,3,,,Si,,Suplemento vitaminico,,Vitamina C
,19-34 años,Masculino,Licenciatura,No,,,,Si,,Suplemento vitaminico,dioxido de cloro,
,19-34 años,Femenino,Licenciatura,Si,3,,,No,,,,
,19-34 años,Masculino,Licenciatura,No,,,,No,,,,
,19-34 años,Femenino,Licenciatura,No,,,,No,,,,
,19-34 años,Masculino,Licenciatura,Si,3,,,Si,,Suplemento vitamínico,,
,19-34 años,Masculino,Licenciatura,No,,,,No,,,,
,19-34 años,Femenino,Licenciatura,No,,,,No,,,,
,19-34 años,Femenino,Licenciatura,No,,,,No,,,,
,19-34 años,Femenino,Licenciatura,No,,,,Si,,Suplemento vitamínico,Medicamento,Ivermectina
,19-34 años,Femenino,Licenciatura,No,,,,No,,,,
,19-34 años,Masculino,Licenciatura,No,,,,Si,,Dioxido de cloro,,
,19-34 años,Masculino,Licenciatura,No,Tratamiento herbolario,,,No,,,,
,19-34 años,Femenino,Licenciatura,No,,,,No,,,,
,19-34 años,Masculino,Licenciatura,No,,,,No,,,,
,19-34 años,Femenino,Licenciatura,No,,,,Si,,Dioxido de cloro,,
,19-34 años,Femenino,Licenciatura,No,,,,No,,,,
,19-34 años,Femenino,Licenciatura,No,,,,No,,,,
,19-34 años,Masculino,Licenciatura,No,,,,Si,,Tratamiento herbolario,,
,19-34 años,Femenino,Licenciatura,Si,3,,,No,,,,
,19-34 años,Femenino,Licenciatura,No,,,,No,,,,
,19-34 años,Femenino,Licenciatura,No,,,,Si,,Dióxido de cloro,Medicamento,AINE
,19-34 años,Femenino,Licenciatura,No,,,,No,,,,
,19-34 años,Masculino,Licenciatura,No,,,,No,,,,
,19-34 años,Masculino,Preparatoria,Si,3,,,Si,,,,
,19-34 años,Femenino,Licenciatura,No,,,,No,,,,
,19-34 años,Femenino,Licenciatura,No,,,,No,,,,
,19-34 años,Masculino,Licenciatura,No,,,,No,,,,
,19-34 años,Masculino,Licenciatura,No,,,,No,,,,
,19-34 años,Femenino,Licenciatura,No,,,,No,,,,
,19-34 años,Femenino,Preparatoria,No,,,,Si,,dióxido de cloro ,,
,19-34 años,Femenino,Licenciatura,No,,,,No,,,,
,19-34 años,Masculino,Licenciatura,No,,,,Si,,Dioxido de cloro ,,
,13-18 años,Femenino,Licenciatura,No,,,,No,,,,
,19-34 años,Femenino,Licenciatura,No,,,,Si,,Dióxido de cloro,,
,19-34 años,Femenino,Licenciatura,No,,,,No,,,,
,19-34 años,Masculino,Licenciatura,Si,3,,,Si,,Suplementos vitamínicos ,,
,19-34 años,Femenino,Licenciatura,No,,,,No,,,,
,19-34 años,Femenino,Licenciatura,No,,,,Si,,Dióxido de cloro ,,
,19-34 años,Femenino,Licenciatura,No,,,,No,,,,
,19-34 años,Femenino,Licenciatura,No,,,,No,,,,
,19-34 años,Femenino,Licenciatura,No,,,,No,,,,
,19-34 años,Femenino,Licenciatura,No,,,,No,,,,
,19-34 años,Femenino,Licenciatura,No,,,,Si,,Suplementos vitamínicos ,,
,19-34 años,Femenino,Licenciatura,No,,,,No,,,,
,19-34 años,Femenino,Licenciatura,Si,3,,,Si,,Dioxido de cloro,,
,19-34 años,Femenino,Licenciatura,No,,,,No,,,,
,19-34 años,Masculino,Licenciatura,No,,,,No,,,,
,19-34 años,Femenino,Licenciatura,No,,,,Si,,Suplemento vitaminico,dioxido de cloro,
,19-34 años,Femenino,Licenciatura,No,,,,No,,,,
,19-34 años,Femenino,Licenciatura,No,,,,No,,,,
,13-18 años,Femenino,Licenciatura,No,,,,Si,,Aspirina ,,
,19-34 años,Femenino,Licenciatura,No,,,,No,,,,
,19-34 años,Femenino,Licenciatura,No,,,,No,,,,
,19-34 años,Femenino,Licenciatura,No,,,,No,,,,
,19-34 años,Femenino,Licenciatura,Si,1,,,No,,,,
,19-34 años,Masculino,Licenciatura,No,,,,No,,,,
,19-34 años,Masculino,Preparatoria,No,,,,No,,,,
,19-34 años,Femenino,Licenciatura,No,,,,Si,,Medicamento ,,
,19-34 años,Femenino,Licenciatura,Si,2,,,Si,,Suplementos vitaminicos ,,
,19-34 años,Femenino,Licenciatura,No,,,,No,,,,
,19-34 años,Femenino,Licenciatura,No,,,,Si,,Dióxido de cloro,,
,19-34 años,Femenino,Licenciatura,No,,,,Si,,Dioxido de cloro ,Tratamiento herbolario,
,19-34 años,Femenino,Licenciatura,No,,,,Si,,Tratamiento herbolario ,suplemento vitamínico,